[Date Prev][Date Next][Thread Prev][Thread Next][Date Index][Thread Index]

Re: [Xen-devel] [xen-4.3-testing test] 26419: regressions - FAIL

>>> On 22.05.14 at 23:16, <Ian.Jackson@xxxxxxxxxxxxx> wrote:
> flight 26419 xen-4.3-testing real [real]
> http://www.chiark.greenend.org.uk/~xensrcts/logs/26419/ 
> Regressions :-(
> Tests which did not succeed and are blocking,
> including tests which could not be run:
>  build-amd64                   5 xen-build                 fail REGR. vs. 
> 26277
>  build-i386                    5 xen-build                 fail REGR. vs. 
> 26277

make -C firmware install
make[3]: Entering directory 
 git://git.seabios.org/seabios.git 3a28511b46f0c2af5fae1b6ed2b0c19d7913cee3 
Cloning into 'seabios-dir-remote.tmp'...
fatal: reference is not a tree: 3a28511b46f0c2af5fae1b6ed2b0c19d7913cee3
make[3]: Leaving directory 
make[3]: *** [seabios-dir] Error 128
make[2]: Leaving directory `/home/osstest/build.26419.build-amd64/xen/tools'
make[2]: *** [subdir-install-firmware] Error 2
make[1]: Leaving directory `/home/osstest/build.26419.build-amd64/xen/tools'
make[1]: *** [subdirs-install] Error 2
make: *** [install-tools] Error 2

Is that an infrastructure problem? It doesn't look like any of the
changes you pushed are seabios related...


Xen-devel mailing list



Lists.xenproject.org is hosted with RackSpace, monitoring our
servers 24x7x365 and backed by RackSpace's Fanatical Support®.